Announcement Announcement Module
Collapse
No announcement yet.
perform test error Page Title Module
Move Remove Collapse
X
Conversation Detail Module
Collapse
  • Filter
  • Time
  • Show
Clear All
new posts

  • perform test error

    Got the following WARNINGs and failures during "perform test":

    java.io.FileNotFoundException: /home/balex/our-wedding.lck (No such file or directory))

  • #2
    Nevermind ... i'm an idiot ... imagine that. So just in case anyone else is as goofed as I am ...

    If you do not replace "/home/balex" in the "database properties set ..." command with your home directory, you will run into this issue.

    another symptom of this problem is:
    Tests run: 9, Failures: 0, Errors: 8, Skipped: 0, Time elapsed: 2.217 sec <<< FAILURE!

    but the main error is "java.io.FileNotFoundException: /home/balex/our-wedding.lck (No such file or directory)) "
    Last edited by vsingleton; Dec 10th, 2009, 01:55 PM.

    Comment

    Working...
    X